Reaction Details
TargetMAP kinase-activated protein kinase 3
LigandBDBM558867
Substrate/Competitorn/a
Meas. Tech.ADP-Glo Kinase Activity Assay
IC50 12000±n/a nM
Citation Scheidt, KASchiltz, GEClutter, MRKwong, AJ 3-arylindazoles as selective MEK4 inhibitors US Patent US11370770 Publication Date 6/28/2022
 
MAP kinase-activated protein kinase 3
Name:MAP kinase-activated protein kinase 3
Type:Serine/threonine-protein kinase
Mol. Mass.:42991.57
Organism:Homo sapiens (Human)
Description:Recombinant MAPKAPK3 was phosphorylated by incubation with active p38alpha before assays.
Residue:382
BDBM558867
NameBDBM558867
Synonyms:US11370770, Compound 6s
TypeSmall organic molecule
Emp. Form.C15H12N2O2
Mol. Mass.252.268
SMILESCc1ccc2[nH]nc(-c3ccc(cc3)C(O)=O)c2c1