Reaction Details
TargetMAP kinase-activated protein kinase 3
LigandBDBM558875
Substrate/Competitorn/a
Meas. Tech.ADP-Glo Kinase Activity Assay
IC50>27000±n/a nM
Citation Scheidt, KASchiltz, GEClutter, MRKwong, AJ 3-arylindazoles as selective MEK4 inhibitors US Patent US11370770 Publication Date 6/28/2022
 
MAP kinase-activated protein kinase 3
Name:MAP kinase-activated protein kinase 3
Type:Serine/threonine-protein kinase
Mol. Mass.:42991.57
Organism:Homo sapiens (Human)
Description:Recombinant MAPKAPK3 was phosphorylated by incubation with active p38alpha before assays.
Residue:382
BDBM558875
NameBDBM558875
Synonyms:US11370770, Compound 6z
TypeSmall organic molecule
Emp. Form.C15H9F3N2O2
Mol. Mass.306.2394
SMILESOC(=O)c1ccc(cc1)-c1n[nH]c2cc(ccc12)C(F)(F)F