Reaction Details
TargetGenome polyprotein
LigandBDBM307512
Substrate/Competitorn/a
Meas. Tech.HBsAg Assay
IC50 44.0±n/a nM
Citation Cheng, ZHan, XWang, YYang, S 6,7-dihydropyrido[2,1-A]phthalazin-2-ones for the treatment and prophylaxis of hepatitis B virus infection US Patent US10150740 Publication Date 12/11/2018
 
Genome polyprotein
Name:Genome polyprotein
Type:Protein
Mol. Mass.:327266.82
Organism:Hepatitis C virus (HCV)
Description:P26664
Residue:3011
BDBM307512
NameBDBM307512
Synonyms:US10150740, Example 8
TypeSmall organic molecule
Emp. Form.C24H30N2O6
Mol. Mass.442.5048
SMILESCOc1cc-2c(CN(CC(C)C)n3cc(C(O)=O)c(=O)cc-23)cc1OCC1CCOCC1