Reaction Details
TargetGenome polyprotein
LigandBDBM307515
Substrate/Competitorn/a
Meas. Tech.HBsAg Assay
IC50 39.0±n/a nM
Citation Cheng, ZHan, XWang, YYang, S 6,7-dihydropyrido[2,1-A]phthalazin-2-ones for the treatment and prophylaxis of hepatitis B virus infection US Patent US10150740 Publication Date 12/11/2018
 
Genome polyprotein
Name:Genome polyprotein
Type:Protein
Mol. Mass.:327266.82
Organism:Hepatitis C virus (HCV)
Description:P26664
Residue:3011
BDBM307515
NameBDBM307515
Synonyms:US10150740, Example 11
TypeSmall organic molecule
Emp. Form.C23H30N2O6
Mol. Mass.430.4941
SMILESCOc1cc-2c(CN(CC(C)C)n3cc(C(O)=O)c(=O)cc-23)cc1OCC(C)(C)CO