Reaction Details
TargetMitogen-activated protein kinase kinase kinase 5
LigandBDBM307639
Substrate/Competitorn/a
Meas. Tech.ASK1 Kinase Assay
IC50<200±n/a nM
Citation Brown, SD ASK1 inhibitor compounds and uses thereof US Patent US10150755 Publication Date 12/11/2018
 
Mitogen-activated protein kinase kinase kinase 5
Name:Mitogen-activated protein kinase kinase kinase 5
Type:Protein
Mol. Mass.:154514.93
Organism:Homo sapiens (Human)
Description:Q99683
Residue:1374
BDBM307639
NameBDBM307639
Synonyms:5-amino-2-(6-(4-cyclopropyl-4H-1,2,4-triazol-3-yl)pyridin-2-yl)isoindolin-1-one | US10150755, Compound 31
TypeSmall organic molecule
Emp. Form.C18H16N6O
Mol. Mass.332.3592
SMILESNc1ccc2C(=O)N(Cc2c1)c1cccc(n1)-c1nncn1C1CC1