Reaction Details
TargetMyosin light chain kinase, smooth muscle
LigandBDBM307674
Substrate/Competitorn/a
Meas. Tech.MYLK/MLCK Assay
Kd<1000±n/a nM
Citation Brown, SD ASK1 inhibitor compounds and uses thereof US Patent US10150755 Publication Date 12/11/2018
 
Myosin light chain kinase, smooth muscle
Name:Myosin light chain kinase, smooth muscle
Type:Protein
Mol. Mass.:210702.56
Organism:Homo sapiens (Human)
Description:Q15746
Residue:1914
BDBM307674
NameBDBM307674
Synonyms:2-(6-(4-cyclopropyl-4H-1,2,4-triazol-3-yl)pyridin-2-yl)-5-methoxy-6-(pyridin-3-yl)isoindolin-1-one | US10150755, Compound 66
TypeSmall organic molecule
Emp. Form.C24H20N6O2
Mol. Mass.424.4546
SMILESCOc1cc2CN(C(=O)c2cc1-c1cccnc1)c1cccc(n1)-c1nncn1C1CC1