Reaction Details
TargetEnoyl-[acyl-carrier-protein] reductase [NADH] FabI
LigandBDBM8738
Substrate/CompetitorBDBM8737
Meas. Tech.Enzyme Inhibition Assay
Temperature303.15±n/a K
IC50 13700±n/a nM
Commentsextracted
Citation Heerding, DAChan, GDeWolf, WEFosberry, APJanson, CAJaworski, DDMcManus, EMiller, WHMoore, TDPayne, DJQiu, XRittenhouse, SFSlater-Radosti, CSmith, WTakata, DTVaidya, KSYuan, CCHuffman, WF 1,4-Disubstituted imidazoles are potential antibacterial agents functioning as inhibitors of enoyl acyl carrier protein reductase (FabI). Bioorg Med Chem Lett11:2061-5 (2001) 
 
Enoyl-[acyl-carrier-protein] reductase [NADH] FabI
Name:Enoyl-[acyl-carrier-protein] reductase [NADH] FabI
Type:Enzyme
Mol. Mass.:27861.12
Organism:Escherichia coli
Description:n/a
Residue:262
BDBM8738
BDBM8737
NameBDBM8738
Synonyms:1-[(4-methylphenyl)methyl]-4-(thiophen-2-yl)-1H-imidazole | Disubstituted imidazole 1
TypeSmall organic molecule
Emp. Form.C15H14N2S
Mol. Mass.254.35
SMILESCc1ccc(Cn2cnc(c2)-c2cccs2)cc1