Reaction Details
TargetEnoyl-[acyl-carrier-protein] reductase [NADH] FabI
LigandBDBM8739
Substrate/CompetitorBDBM8737
Meas. Tech.Enzyme Inhibition Assay
Temperature303.15±n/a K
IC50 3920±n/a nM
Commentsextracted
Citation Heerding, DAChan, GDeWolf, WEFosberry, APJanson, CAJaworski, DDMcManus, EMiller, WHMoore, TDPayne, DJQiu, XRittenhouse, SFSlater-Radosti, CSmith, WTakata, DTVaidya, KSYuan, CCHuffman, WF 1,4-Disubstituted imidazoles are potential antibacterial agents functioning as inhibitors of enoyl acyl carrier protein reductase (FabI). Bioorg Med Chem Lett11:2061-5 (2001) 
 
Enoyl-[acyl-carrier-protein] reductase [NADH] FabI
Name:Enoyl-[acyl-carrier-protein] reductase [NADH] FabI
Type:Enzyme
Mol. Mass.:27861.12
Organism:Escherichia coli
Description:n/a
Residue:262
BDBM8739
BDBM8737
NameBDBM8739
Synonyms:4-(4-methoxyphenyl)-1-[(4-methylphenyl)methyl]-1H-imidazole | Disubstituted imidazole 4
TypeSmall organic molecule
Emp. Form.C18H18N2O
Mol. Mass.278.3483
SMILESCOc1ccc(cc1)-c1cn(Cc2ccc(C)cc2)cn1