Reaction Details
TargetEnoyl-[acyl-carrier-protein] reductase [NADH] FabI
LigandBDBM8740
Substrate/CompetitorBDBM8737
Meas. Tech.Enzyme Inhibition Assay
Temperature303.15±n/a K
IC50 26900±n/a nM
Commentsextracted
Citation Heerding, DAChan, GDeWolf, WEFosberry, APJanson, CAJaworski, DDMcManus, EMiller, WHMoore, TDPayne, DJQiu, XRittenhouse, SFSlater-Radosti, CSmith, WTakata, DTVaidya, KSYuan, CCHuffman, WF 1,4-Disubstituted imidazoles are potential antibacterial agents functioning as inhibitors of enoyl acyl carrier protein reductase (FabI). Bioorg Med Chem Lett11:2061-5 (2001) 
 
Enoyl-[acyl-carrier-protein] reductase [NADH] FabI
Name:Enoyl-[acyl-carrier-protein] reductase [NADH] FabI
Type:Enzyme
Mol. Mass.:27861.12
Organism:Escherichia coli
Description:n/a
Residue:262
BDBM8740
BDBM8737
NameBDBM8740
Synonyms:1-[(3-nitrophenyl)methyl]-4-(thiophen-3-yl)-1H-imidazole | Disubstituted imidazole 8
TypeSmall organic molecule
Emp. Form.C14H11N3O2S
Mol. Mass.285.321
SMILESO=N(=O)c1cccc(Cn2cnc(c2)-c2ccsc2)c1