Reaction Details
TargetEnoyl-[acyl-carrier-protein] reductase [NADH] FabI
LigandBDBM8741
Substrate/CompetitorBDBM8737
Meas. Tech.Enzyme Inhibition Assay
Temperature303.15±n/a K
IC50 5140±n/a nM
Commentsextracted
Citation Heerding, DAChan, GDeWolf, WEFosberry, APJanson, CAJaworski, DDMcManus, EMiller, WHMoore, TDPayne, DJQiu, XRittenhouse, SFSlater-Radosti, CSmith, WTakata, DTVaidya, KSYuan, CCHuffman, WF 1,4-Disubstituted imidazoles are potential antibacterial agents functioning as inhibitors of enoyl acyl carrier protein reductase (FabI). Bioorg Med Chem Lett11:2061-5 (2001) 
 
Enoyl-[acyl-carrier-protein] reductase [NADH] FabI
Name:Enoyl-[acyl-carrier-protein] reductase [NADH] FabI
Type:Enzyme
Mol. Mass.:27861.12
Organism:Escherichia coli
Description:n/a
Residue:262
BDBM8741
BDBM8737
NameBDBM8741
Synonyms:4-{[4-(thiophen-3-yl)-1H-imidazol-1-yl]methyl}aniline | Disubstituted imidazole 20
TypeSmall organic molecule
Emp. Form.C14H13N3S
Mol. Mass.255.338
SMILESNc1ccc(Cn2cnc(c2)-c2ccsc2)cc1