Reaction Details
TargetPhosphatidylinositol 4,5-bisphosphate 3-kinase catalytic subunit delta isoform
LigandBDBM571548
Substrate/Competitorn/a
Meas. Tech.Enzymatic Activity of PI3K Isoform
IC50 0.140±n/a nM
Citation Hao, X Quinoline analogs as phosphatidylinositol 3-kinase inhibitors US Patent US11446301 Publication Date 9/20/2022
 
Phosphatidylinositol 4,5-bisphosphate 3-kinase catalytic subunit delta isoform
Name:Phosphatidylinositol 4,5-bisphosphate 3-kinase catalytic subunit delta isoform
Type:Enzyme Subunit
Mol. Mass.:119489.41
Organism:Homo sapiens (Human)
Description:O00329
Residue:1044
BDBM571548
NameBDBM571548
Synonyms:US11446301, Compound 5
TypeSmall organic molecule
Emp. Form.C22H17F2N7
Mol. Mass.417.4141
SMILESCC(Nc1nc(N)nc(N)c1C#N)c1cc2ccc(F)cc2nc1-c1cccc(F)c1