Reaction Details
TargetTyrosine-protein kinase JAK2
LigandBDBM333120
Substrate/Competitorn/a
Meas. Tech.Biochemical JAK Kinase Assay
Ki 0.020±n/a nM
Citation Fatheree, PRBrandt, GESmith, CSullivan, SDVan Orden, LJ JAK inhibitors containing a 4-membered heterocyclic amide US Patent US11453668 Publication Date 9/27/2022
 
Tyrosine-protein kinase JAK2
Name:Tyrosine-protein kinase JAK2
Type:Protein
Mol. Mass.:130684.68
Organism:Homo sapiens (Human)
Description:O60674
Residue:1132
BDBM333120
NameBDBM333120
Synonyms:(S)-(3-(dimethylamino)azetidin-1-yl)(2-(6-(2-ethyl-5-fluoro-4-hydroxyphenyl)-1H-indazol-3-yl)-5-isopropyl-4,5,6,7-tetrahydro-3H-imidazo[4,5-c]pyridin-6-yl)methanone US10550118, Example 8-7 US10947229, Example C-1 US11634419, Example C-1 | US11702415, Compound C-1
TypeSmall organic molecule
Emp. Form.C30H36FN7O2
Mol. Mass.545.6509
SMILESCCc1cc(O)c(F)cc1-c1ccc2c(n[nH]c2c1)-c1nc2C[C@H](N(Cc2[nH]1)C(C)C)C(=O)N1CC(C1)N(C)C