Reaction Details
TargetSerine/threonine-protein kinase LATS2
LigandBDBM573884
Substrate/Competitorn/a
Meas. Tech.LATS2 Biochemical Caliper Assay
IC50 1.000±n/a nM
Citation Behnke, DBerenshteyn, FHao, XHoffman, TJin, QLacoste, ALee, CLiu, JLiu, YMaibaum, JKMo, TPan, JQu, XTchorz, JXie, YFYan, SZou, Y 6-6 fused bicyclic heteroaryl compounds and their use as LATS inhibitors US Patent US11458138 Publication Date 10/4/2022
 
Serine/threonine-protein kinase LATS2
Name:Serine/threonine-protein kinase LATS2
Type:PROTEIN
Mol. Mass.:120160.09
Organism:Homo sapiens (Human)
Description:ChEMBL_587187
Residue:1088
BDBM573884
NameBDBM573884
Synonyms:US11458138, Example 4
TypeSmall organic molecule
Emp. Form.C15H12F3N5
Mol. Mass.319.2845
SMILESCC(Nc1nc(nc2cnccc12)-c1ccncc1)C(F)(F)F