Reaction Details
TargetSerine/threonine-protein kinase LATS1
LigandBDBM574282
Substrate/Competitorn/a
Meas. Tech.LATS1 Biochemical Assay: Homogenous Time Resolved Fluorescence (HTRF) Assay
IC50 1.000±n/a nM
Citation Behnke, DBerenshteyn, FHao, XHoffman, TJin, QLacoste, ALee, CLiu, JLiu, YMaibaum, JKMo, TPan, JQu, XTchorz, JXie, YFYan, SZou, Y 6-6 fused bicyclic heteroaryl compounds and their use as LATS inhibitors US Patent US11458138 Publication Date 10/4/2022
 
Serine/threonine-protein kinase LATS1
Name:Serine/threonine-protein kinase LATS1
Type:PROTEIN
Mol. Mass.:126893.90
Organism:Homo sapiens (Human)
Description:ChEMBL_774443
Residue:1130
BDBM574282
NameBDBM574282
Synonyms:US11458138, Example 111
TypeSmall organic molecule
Emp. Form.C16H15F3N6
Mol. Mass.348.3257
SMILESFC(F)(F)c1n[nH]cc1-c1nc(NC2CCCC2)c2ccncc2n1