Reaction Details
TargetSerine/threonine-protein kinase LATS1
LigandBDBM574285
Substrate/Competitorn/a
Meas. Tech.LATS1 Biochemical Assay: Homogenous Time Resolved Fluorescence (HTRF) Assay
IC50 2.00±n/a nM
Citation Behnke, DBerenshteyn, FHao, XHoffman, TJin, QLacoste, ALee, CLiu, JLiu, YMaibaum, JKMo, TPan, JQu, XTchorz, JXie, YFYan, SZou, Y 6-6 fused bicyclic heteroaryl compounds and their use as LATS inhibitors US Patent US11458138 Publication Date 10/4/2022
 
Serine/threonine-protein kinase LATS1
Name:Serine/threonine-protein kinase LATS1
Type:PROTEIN
Mol. Mass.:126893.90
Organism:Homo sapiens (Human)
Description:ChEMBL_774443
Residue:1130
BDBM574285
NameBDBM574285
Synonyms:US11458138, Example 114
TypeSmall organic molecule
Emp. Form.C26H26N6O2S
Mol. Mass.486.589
SMILESCc1c(-c2nc(NC(C)(C)C)c3ccncc3n2)c2cccnc2n1S(=O)(=O)c1ccc(C)cc1