Reaction Details
TargetSerine/threonine-protein kinase LATS1
LigandBDBM574370
Substrate/Competitorn/a
Meas. Tech.LATS1 Biochemical Assay: Homogenous Time Resolved Fluorescence (HTRF) Assay
IC50 1.000±n/a nM
Citation Behnke, DBerenshteyn, FHao, XHoffman, TJin, QLacoste, ALee, CLiu, JLiu, YMaibaum, JKMo, TPan, JQu, XTchorz, JXie, YFYan, SZou, Y 6-6 fused bicyclic heteroaryl compounds and their use as LATS inhibitors US Patent US11458138 Publication Date 10/4/2022
 
Serine/threonine-protein kinase LATS1
Name:Serine/threonine-protein kinase LATS1
Type:PROTEIN
Mol. Mass.:126893.90
Organism:Homo sapiens (Human)
Description:ChEMBL_774443
Residue:1130
BDBM574370
NameBDBM574370
Synonyms:US11458138, Example 199
TypeSmall organic molecule
Emp. Form.C17H17N5
Mol. Mass.291.3504
SMILESCc1nccc2c(NC3(C)CC3)nc(nc12)-c1ccncc1