Reaction Details
TargetSerine/threonine-protein kinase LATS1
LigandBDBM574427
Substrate/Competitorn/a
Meas. Tech.LATS1 Biochemical Caliper Assay
IC50 1.90±n/a nM
Citation Behnke, DBerenshteyn, FHao, XHoffman, TJin, QLacoste, ALee, CLiu, JLiu, YMaibaum, JKMo, TPan, JQu, XTchorz, JXie, YFYan, SZou, Y 6-6 fused bicyclic heteroaryl compounds and their use as LATS inhibitors US Patent US11458138 Publication Date 10/4/2022
 
Serine/threonine-protein kinase LATS1
Name:Serine/threonine-protein kinase LATS1
Type:PROTEIN
Mol. Mass.:126893.90
Organism:Homo sapiens (Human)
Description:ChEMBL_774443
Residue:1130
BDBM574427
NameBDBM574427
Synonyms:US11458138, Example 307
TypeSmall organic molecule
Emp. Form.C17H17N5
Mol. Mass.291.3504
SMILESCC1(CCC1)Nc1cc(nc2cnccc12)-c1ccncn1