Reaction Details
TargetSerine/threonine-protein kinase LATS1
LigandBDBM574440
Substrate/Competitorn/a
Meas. Tech.LATS1 Biochemical Caliper Assay
IC50 0.700±n/a nM
Citation Behnke, DBerenshteyn, FHao, XHoffman, TJin, QLacoste, ALee, CLiu, JLiu, YMaibaum, JKMo, TPan, JQu, XTchorz, JXie, YFYan, SZou, Y 6-6 fused bicyclic heteroaryl compounds and their use as LATS inhibitors US Patent US11458138 Publication Date 10/4/2022
 
Serine/threonine-protein kinase LATS1
Name:Serine/threonine-protein kinase LATS1
Type:PROTEIN
Mol. Mass.:126893.90
Organism:Homo sapiens (Human)
Description:ChEMBL_774443
Residue:1130
BDBM574440
NameBDBM574440
Synonyms:US11458138, Example 320
TypeSmall organic molecule
Emp. Form.C18H22N6
Mol. Mass.322.4075
SMILESCC(C)(N)C(C)(C)Nc1nc(nc2cnccc12)-c1ccncc1