Reaction Details
TargetInterferon-induced, double-stranded RNA-activated protein kinase
LigandBDBM308051
Substrate/Competitorn/a
Meas. Tech.PDGFRβ Kinase Assay
Ki 39.0±n/a nM
Citation Boral, SMalone, TCWang, SRao, SYang, R Heterocycle-substituted pyridyl benzothiophenes as kinase inhibitors US Patent US9650366 Publication Date 5/16/2017
 
Interferon-induced, double-stranded RNA-activated protein kinase
Name:Interferon-induced, double-stranded RNA-activated protein kinase
Type:PROTEIN
Mol. Mass.:62104.61
Organism:Homo sapiens (Human)
Description:ChEMBL_1467743
Residue:551
BDBM308051
NameBDBM308051
Synonyms:US10011593, Ex. 3 | US9650366, 3
TypeSmall organic molecule
Emp. Form.C25H20ClF3N8O2S
Mol. Mass.588.992
SMILESNc1ncc(cc1-c1cc2cc(NC(=O)Nc3ccc(Cl)c(c3)C(F)(F)F)ccc2s1)-c1nnn(CCCO)n1