Reaction Details
TargetVascular endothelial growth factor receptor 2
LigandBDBM308059
Substrate/Competitorn/a
Meas. Tech.VEGFR2 Kinase Assay
Ki 7.00±n/a nM
Citation Boral, SMalone, TCWang, SRao, SYang, R Heterocycle-substituted pyridyl benzothiophenes as kinase inhibitors US Patent US9650366 Publication Date 5/16/2017
 
Vascular endothelial growth factor receptor 2
Name:Vascular endothelial growth factor receptor 2
Type:Receptor Tyrosine Kinase
Mol. Mass.:151510.97
Organism:Homo sapiens (Human)
Description:P35968
Residue:1356
BDBM308059
NameBDBM308059
Synonyms:US10011593, Ex. 10 | US9650366, 10
TypeSmall organic molecule
Emp. Form.C25H22N6O2
Mol. Mass.438.4812
SMILESCc1cccc(c1)C(=O)Nc1cccc(c1)C#Cc1cncc(c1)-c1nnn(CCCO)n1