Reaction Details
TargetCannabinoid receptor 1
LigandBDBM50288370
Substrate/Competitorn/a
Meas. Tech.Presto-Tango -Arrestin Recruitment Assay
EC50 0.030±n/a nM
Citation Das, ARoy, J Docosahexaenoic acid endocannabinoid epoxide derivative compositions US Patent US11472787 Publication Date 10/18/2022
 
Cannabinoid receptor 1
Name:Cannabinoid receptor 1
Type:G Protein-Coupled Receptor (GPCR)
Mol. Mass.:52868.96
Organism:Homo sapiens (Human)
Description:P21554
Residue:472
BDBM50288370
NameBDBM50288370
Synonyms:CHEMBL4169198 | US11472787, Compound 10,11-EDP-CA
TypeSmall organic molecule
Emp. Form.C25H37NO2
Mol. Mass.383.5668
SMILESCC\C=C/C\C=C/C\C=C/CC1OC1C\C=C/C\C=C/CCC(=O)NC1CC1