Reaction Details
TargetAlpha-1,3-mannosyl-glycoprotein 2-beta-N-acetylglucosaminyltransferase
LigandBDBM309226
Substrate/Competitorn/a
Meas. Tech.Radioligand Binding Assay
Ki<10.00±n/a nM
Citation Amberg, WPohlki, FLange, UWang, YXZhao, HHLi, HBrewer, JTZanze, IDietrich, JVasudevan, ADjuric, SWLao, YHutchins, CW Pyrrolidine derivatives, pharmaceutical compositions containing them, and their use in therapy US Patent US9656955 Publication Date 5/23/2017
 
Alpha-1,3-mannosyl-glycoprotein 2-beta-N-acetylglucosaminyltransferase
Name:Alpha-1,3-mannosyl-glycoprotein 2-beta-N-acetylglucosaminyltransferase
Type:PROTEIN
Mol. Mass.:50891.32
Organism:Homo sapiens (Human)
Description:ChEMBL_107587
Residue:445
BDBM309226
NameBDBM309226
Synonyms:(3R,4S)-4-(4-fluorophenyl)-N-[4-fluoro-3-(pyrimidin-5-yl)phenyl]-1-[(1-methyl-1H-imidazol-4-yl)sulfonyl]pyrrolidin-3-amin | US9656955, Example 749
TypeSmall Organic Molecule
Emp. Form.C24H22F2N6O2S
Mol. Mass.496.532
SMILESCn1cnc(c1)S(=O)(=O)N1C[C@H](Nc2ccc(F)c(c2)-c2cncnc2)[C@H](C1)c1ccc(F)cc1