Reaction Details
TargetMu-type opioid receptor
LigandBDBM50240437
Substrate/Competitorn/a
Meas. Tech.Opioid Receptor Binding Assay
Ki 0.190±n/a nM
Citation Blumberg, LCDeaver, DREyerman, DJWynn, TA Methods for treating depressive symptoms US Patent US9656961 Publication Date 5/23/2017
 
Mu-type opioid receptor
Name:Mu-type opioid receptor
Type:G Protein-Coupled Receptor (GPCR)
Mol. Mass.:44789.51
Organism:Homo sapiens (Human)
Description:P35372
Residue:400
BDBM50240437
NameBDBM50240437
Synonyms:(-)-17-(cyclobutylmethyl)morphinan-3,14-diol (-)-butorphanol BUTORPHANOL US10231963, Table B.3 US11534436, Compound Table B.3 | US9656961, Example 00120
TypeSmall organic molecule
Emp. Form.C21H29NO2
Mol. Mass.327.4605
SMILESOc1ccc2C[C@H]3N(CC4CCC4)CC[C@@]4(CCCC[C@@]34O)c2c1