Reaction Details
TargetMu-type opioid receptor
LigandBDBM309336
Substrate/Competitorn/a
Meas. Tech.Opioid Receptor Binding Assay
IC50 0.280±n/a nM
Citation Blumberg, LCDeaver, DREyerman, DJWynn, TA Methods for treating depressive symptoms US Patent US9656961 Publication Date 5/23/2017
 
Mu-type opioid receptor
Name:Mu-type opioid receptor
Type:G Protein-Coupled Receptor (GPCR)
Mol. Mass.:44789.51
Organism:Homo sapiens (Human)
Description:P35372
Residue:400
BDBM309336
NameBDBM309336
Synonyms:US10231963, Table B.4 | US9656961, Example 00121
TypeSmall organic molecule
Emp. Form.C31H39NO4S
Mol. Mass.521.711
SMILESCO[C@]12CC[C@@]3(CC1[C@](C)(O)CCc1cccs1)[C@H]1Cc4ccc(O)c5O[C@@H]2[C@]3(CCN1CC1CC1)c45