Reaction Details
TargetMu-type opioid receptor
LigandBDBM50249017
Substrate/Competitorn/a
Meas. Tech.Opioid Receptor Binding Assay
EC50 0.075±n/a nM
Citation Blumberg, LCDeaver, DREyerman, DJWynn, TA Methods for treating depressive symptoms US Patent US9656961 Publication Date 5/23/2017
 
Mu-type opioid receptor
Name:Mu-type opioid receptor
Type:G Protein-Coupled Receptor (GPCR)
Mol. Mass.:44789.51
Organism:Homo sapiens (Human)
Description:P35372
Residue:400
BDBM50249017
NameBDBM50249017
Synonyms:14-O-phenylpropylnaltrexone CHEMBL514774 US11534436, Compound Table B.14 | US9656961, Example 00131
TypeSmall organic molecule
Emp. Form.C29H33NO4
Mol. Mass.459.5766
SMILESOc1ccc2C[C@H]3N(CC4CC4)CC[C@@]45[C@@H](Oc1c24)C(=O)CC[C@@]35OCCCc1ccccc1