Reaction Details
TargetMu-type opioid receptor
LigandBDBM179880
Substrate/Competitorn/a
Meas. Tech.Opioid Receptor Binding Assay
Ki 0.560±n/a nM
Citation Blumberg, LCDeaver, DREyerman, DJWynn, TA Methods for treating depressive symptoms US Patent US9656961 Publication Date 5/23/2017
 
Mu-type opioid receptor
Name:Mu-type opioid receptor
Type:G Protein-Coupled Receptor (GPCR)
Mol. Mass.:44789.51
Organism:Homo sapiens (Human)
Description:P35372
Residue:400
BDBM179880
NameBDBM179880
Synonyms:US10231963, Table B.26 US10736890, Compound TABLE B.26 US11534436, Compound Table B.26 US9656961, Example 00143
TypeSmall organic molecule
Emp. Form.C22H28N2O4
Mol. Mass.384.4687
SMILES[#6]\[#6](-[#6])=[#6]\[#6]-[#7]-1-[#6]-[#6][C@]23[#6]-[#6](=O)-[#6]-[#6][C@@]2([#8])[#6@H]-1-[#6]-c1ccc(-[#6](-[#7])=O)c(-[#8])c31