Reaction Details
TargetMu-type opioid receptor
LigandBDBM179882
Substrate/Competitorn/a
Meas. Tech.Opioid Receptor Binding Assay
Ki 0.100±n/a nM
Citation Blumberg, LCDeaver, DREyerman, DJWynn, TA Methods for treating depressive symptoms US Patent US9656961 Publication Date 5/23/2017
 
Mu-type opioid receptor
Name:Mu-type opioid receptor
Type:G Protein-Coupled Receptor (GPCR)
Mol. Mass.:44789.51
Organism:Homo sapiens (Human)
Description:P35372
Residue:400
BDBM179882
NameBDBM179882
Synonyms:US10287250, Compound B.10 US9133125, Table B, Compound 10 | US9656961, Example 00146
TypeSmall organic molecule
Emp. Form.C20H28N2O
Mol. Mass.312.4491
SMILESC[C@H]1[C@H]2Cc3ccc(cc3[C@]1(C)CCN2CC1CCC1)C(N)=O