Reaction Details
TargetLysine-specific histone demethylase 1A
LigandBDBM456304
Substrate/Competitorn/a
Meas. Tech.Inhibitory Activity (In Vitro)
IC50 0.120±n/a nM
Citation Osada, A Anti-tumor effect potentiator using novel biphenyl compound US Patent US11510915 Publication Date 11/29/2022
 
Lysine-specific histone demethylase 1A
Name:Lysine-specific histone demethylase 1A
Type:Enzyme
Mol. Mass.:92901.01
Organism:Homo sapiens (Human)
Description:O60341
Residue:852
BDBM456304
NameBDBM456304
Synonyms:US10723742, Example 123 US11510915, Example 123
TypeSmall organic molecule
Emp. Form.C30H26F2N4O
Mol. Mass.496.5504
SMILESCn1ccc2cc(c(F)cc12)-c1ccc(cc1-c1ccc(C#N)c(F)c1)C(=O)N1C2CCC1CC(N)C2