Reaction Details
TargetLysine-specific histone demethylase 1A
LigandBDBM456485
Substrate/Competitorn/a
Meas. Tech.Inhibitory Activity (In Vitro)
IC50 0.140±n/a nM
Citation Osada, A Anti-tumor effect potentiator using novel biphenyl compound US Patent US11510915 Publication Date 11/29/2022
 
Lysine-specific histone demethylase 1A
Name:Lysine-specific histone demethylase 1A
Type:Enzyme
Mol. Mass.:92901.01
Organism:Homo sapiens (Human)
Description:O60341
Residue:852
BDBM456485
NameBDBM456485
Synonyms:US10723742, Example 211 | US11510915, Example 211
TypeSmall organic molecule
Emp. Form.C31H29ClF2N6O2
Mol. Mass.591.051
SMILESCC(C)(O)Cn1nnc2cc(c(F)c(Cl)c12)-c1ccc(cc1-c1ccc(C#N)c(F)c1)C(=O)N1C2CCC1CC(N)C2