Reaction Details
TargetLysine-specific histone demethylase 1A
LigandBDBM456531
Substrate/Competitorn/a
Meas. Tech.Inhibitory Activity (In Vitro)
IC50 0.140±n/a nM
Citation Osada, A Anti-tumor effect potentiator using novel biphenyl compound US Patent US11510915 Publication Date 11/29/2022
 
Lysine-specific histone demethylase 1A
Name:Lysine-specific histone demethylase 1A
Type:Enzyme
Mol. Mass.:92901.01
Organism:Homo sapiens (Human)
Description:O60341
Residue:852
BDBM456531
NameBDBM456531
Synonyms:US10723742, Example 260 US11510915, Example 263
TypeSmall organic molecule
Emp. Form.C32H28F4N6O2
Mol. Mass.604.5973
SMILESN[C@H]1C[C@H]2CC[C@@H]1N2C(=O)c1ccc(c(c1)-c1ccc(C#N)c(F)c1)-c1cc2nnn(CC3(O)CCC3)c2c(C(F)F)c1F