Reaction Details
TargetLysine-specific histone demethylase 1A
LigandBDBM581933
Substrate/Competitorn/a
Meas. Tech.Inhibitory Activity (In Vitro)
IC50 0.075±n/a nM
Citation Osada, A Anti-tumor effect potentiator using novel biphenyl compound US Patent US11510915 Publication Date 11/29/2022
 
Lysine-specific histone demethylase 1A
Name:Lysine-specific histone demethylase 1A
Type:Enzyme
Mol. Mass.:92901.01
Organism:Homo sapiens (Human)
Description:O60341
Residue:852
BDBM581933
NameBDBM581933
Synonyms:US11510915, Example 288
TypeSmall organic molecule
Emp. Form.C32H33ClF2N6O
Mol. Mass.591.094
SMILESCCC(O)(CC)Cn1nnc2cc(c(F)c(Cl)c12)-c1ccc(CN2[C@@H]3CC[C@H]2[C@@H](N)C3)cc1-c1ccc(C#N)c(F)c1