Reaction Details
TargetCytochrome P450 11B2, mitochondrial
LigandBDBM8871
Substrate/CompetitorBDBM8582
Meas. Tech.CYP11B Assay
IC50 24.8±n/a nM
Citation Ulmschneider, SMuller-Vieira, UMitrenga, MHartmann, RWOberwinkler-Marchais, SKlein, CDBureik, MBernhardt, RAntes, ILengauer, T Synthesis and evaluation of imidazolylmethylenetetrahydronaphthalenes and imidazolylmethyleneindanes: potent inhibitors of aldosterone synthase. J Med Chem48:1796-805 (2005) 
 
Cytochrome P450 11B2, mitochondrial
Name:Cytochrome P450 11B2, mitochondrial
Type:Protein
Mol. Mass.:57582.15
Organism:Homo sapiens (Human)
Description:P19099
Residue:503
BDBM8871
BDBM8582
NameBDBM8871
Synonyms:5-[(1E)-1,2,3,4-tetrahydronaphthalen-1-ylidenemethyl]-1H-imidazole Imidazolylmethylenetetrahydronaphthalene 1a | Imidazolylmethylenetetrahydronaphthalene 1b
TypeSmall organic molecule
Emp. Form.C14H14N2
Mol. Mass.210.2744
SMILESC1CC(=Cc2cnc[nH]2)c2ccccc2C1