Reaction Details
TargetMitogen-activated protein kinase 14
LigandBDBM50099345
Substrate/Competitorn/a
Meas. Tech.D3R2023
Kd 2.00±n/a nM
Citation D3R, DD Drug Design Data Resource Grand Challenge 3 Dataset: p38a D3R D3R Publication Date 2/6/2020
 
Mitogen-activated protein kinase 14
Name:Mitogen-activated protein kinase 14
Type:Serine/threonine-protein kinase
Mol. Mass.:41286.76
Organism:Homo sapiens (Human)
Description:Q16539
Residue:360
BDBM50099345
NameBDBM50099345
Synonyms:2-(2,5-Dimethyl-phenoxy)-4-[5-(4-fluoro-phenyl)-3-piperidin-4-yl-3H-imidazol-4-yl]-pyrimidine D3RKN_54
TypeSmall organic molecule
Emp. Form.C26H26FN5O
Mol. Mass.443.5159
SMILESCc1ccc(C)c(Oc2nccc(n2)-c2c(ncn2C2CCNCC2)-c2ccc(F)cc2)c1