Reaction Details
TargetProteasome subunit alpha type-6
LigandBDBM50462625
Substrate/Competitorn/a
Meas. Tech.Proteasome Inhibitory Activity
IC50 7.52±n/a nM
Citation Qin, Y Synthesis of peptide borate ester compound and use thereof US Patent US11542283 Publication Date 1/3/2023
 
Proteasome subunit alpha type-6
Name:Proteasome subunit alpha type-6
Type:PROTEIN
Mol. Mass.:27399.66
Organism:Homo sapiens (Human)
Description:ChEMBL_106197
Residue:246
BDBM50462625
NameBDBM50462625
Synonyms:CHEMBL4243375 | US11542283, Compound IV-8
TypeSmall organic molecule
Emp. Form.C16H23BCl2N2O5
Mol. Mass.405.081
SMILESCOC[C@H](NC(=O)c1cc(Cl)ccc1Cl)C(=O)N[C@@H](CC(C)C)B(O)O