Reaction Details
TargetProteasome subunit alpha type-6
LigandBDBM588478
Substrate/Competitorn/a
Meas. Tech.Proteasome Inhibitory Activity
IC50 4.86±n/a nM
Citation Qin, Y Synthesis of peptide borate ester compound and use thereof US Patent US11542283 Publication Date 1/3/2023
 
Proteasome subunit alpha type-6
Name:Proteasome subunit alpha type-6
Type:PROTEIN
Mol. Mass.:27399.66
Organism:Homo sapiens (Human)
Description:ChEMBL_106197
Residue:246
BDBM588478
NameBDBM588478
Synonyms:(R)-N-(2,5-dichlorobenzoyl)-3- methylmercaptopropionamido-D-leucine boric acid | US11542283, Compound IV-9
TypeSmall organic molecule
Emp. Form.C16H23BCl2N2O4S
Mol. Mass.421.147
SMILESCSC[C@H](NC(=O)c1cc(Cl)ccc1Cl)C(=O)N[C@@H](CC(C)C)B(O)O