Reaction Details
TargetProteasome subunit alpha type-6
LigandBDBM588480
Substrate/Competitorn/a
Meas. Tech.Proteasome Inhibitory Activity
IC50 8.20±n/a nM
Citation Qin, Y Synthesis of peptide borate ester compound and use thereof US Patent US11542283 Publication Date 1/3/2023
 
Proteasome subunit alpha type-6
Name:Proteasome subunit alpha type-6
Type:PROTEIN
Mol. Mass.:27399.66
Organism:Homo sapiens (Human)
Description:ChEMBL_106197
Residue:246
BDBM588480
NameBDBM588480
Synonyms:(S)-N-(2,5-dichlorobenzoyl)-3- methoxypropionamido-D-leucine borate citrate | US11542283, Compound V-8B
TypeSmall organic molecule
Emp. Form.C22H27BCl2N2O10
Mol. Mass.561.174
SMILESCOC[C@H](NC(=O)c1cc(Cl)ccc1Cl)C(=O)N[C@@H](CC(C)C)B1OC(=O)CC(CC(O)=O)(O1)C(O)=O