Reaction Details
TargetProteasome subunit alpha type-6
LigandBDBM50069989
Substrate/Competitorn/a
Meas. Tech.Proteasome Inhibitory Activity
IC50 9.92±n/a nM
Citation Qin, Y Synthesis of peptide borate ester compound and use thereof US Patent US11542283 Publication Date 1/3/2023
 
Proteasome subunit alpha type-6
Name:Proteasome subunit alpha type-6
Type:PROTEIN
Mol. Mass.:27399.66
Organism:Homo sapiens (Human)
Description:ChEMBL_106197
Residue:246
BDBM50069989
NameBDBM50069989
Synonyms:(R)-3-methyl-1-((S)-3-phenyl-2-(pyrazine-2-carboxamido)propanamido)butylboronic acid BORTEZOMIB Dipeptidyl boronic acid derivative N-[(1R)-1-(DIHYDROXYBORYL)-3-METHYLBUTYL]-N-(PYRAZIN-2-YLCARBONYL)-L-PHENYLALANINAMIDE Peptidyl boronic acid derivative Velcade | cid_387447
TypeSmall organic molecule
Emp. Form.C19H25BN4O4
Mol. Mass.384.237
SMILESCC(C)C[C@H](NC(=O)[C@H](Cc1ccccc1)NC(=O)c1cnccn1)B(O)O