Reaction Details
TargetSolute carrier family 22 member 2
LigandBDBM589177
Substrate/Competitorn/a
Meas. Tech.OCT2 Inhibition Assay
IC50 137±n/a nM
Citation Bacon, EMCai, ZRChen, XCottell, JJDesai, MCJi, MJin, HLazerwith, SEMish, MRMorganelli, PAPyun, HTaylor, JGTrejo Martin, TA Substituted 1,4-methanopyrido[1′,2′:4,5]pyrazino[1,2-a]pyrimidines for treating viral infections US Patent US11548901 Publication Date 1/10/2023
 
Solute carrier family 22 member 2
Name:Solute carrier family 22 member 2
Type:PROTEIN
Mol. Mass.:62591.01
Organism:Homo sapiens (Human)
Description:ChEMBL_1484077
Residue:555
BDBM589177
NameBDBM589177
Synonyms:US11548901, Compound 45
TypeSmall organic molecule
Emp. Form.C21H18F3N3O5
Mol. Mass.449.3799
SMILESOc1c2C(=O)N3[C@@H]4CC[C@@H](C4)O[C@H]3Cn2cc(C(=O)NCc2c(F)cc(F)cc2F)c1=O