Reaction Details
TargetSolute carrier family 22 member 2
LigandBDBM330052
Substrate/Competitorn/a
Meas. Tech.OCT2 Inhibition Assay
IC50 476±n/a nM
Citation Bacon, EMCai, ZRChen, XCottell, JJDesai, MCJi, MJin, HLazerwith, SEMish, MRMorganelli, PAPyun, HTaylor, JGTrejo Martin, TA Substituted 1,4-methanopyrido[1′,2′:4,5]pyrazino[1,2-a]pyrimidines for treating viral infections US Patent US11548901 Publication Date 1/10/2023
 
Solute carrier family 22 member 2
Name:Solute carrier family 22 member 2
Type:PROTEIN
Mol. Mass.:62591.01
Organism:Homo sapiens (Human)
Description:ChEMBL_1484077
Residue:555
BDBM330052
NameBDBM330052
Synonyms:(1R,4S,12aS)-7-hydroxy-6,8-dioxo-N-(2,4,6-trifluorobenzyl)-1,2,3,4,6,8,12,12a-octahydro-1,4-methanodipyrido[1,2-a:1′,2′-d]pyrazine-9-carboxamide US11548901, Compound 55 US9732092, Compound 55
TypeSmall organic molecule
Emp. Form.C21H18F3N3O4
Mol. Mass.433.3805
SMILESOc1c2C(=O)N3[C@H]4CC[C@H](C4)[C@H]3Cn2cc(C(=O)NCc2c(F)cc(F)cc2F)c1=O