Reaction Details
TargetMitogen-activated protein kinase kinase kinase 5
LigandBDBM307610
Substrate/Competitorn/a
Meas. Tech.ASK1 Kinase Assay
Ki<200±n/a nM
Citation Brown, SD ASK1 inhibitor compounds and uses thereof US Patent US10150755 Publication Date 12/11/2018
 
Mitogen-activated protein kinase kinase kinase 5
Name:Mitogen-activated protein kinase kinase kinase 5
Type:Protein
Mol. Mass.:154514.93
Organism:Homo sapiens (Human)
Description:Q99683
Residue:1374
BDBM307610
NameBDBM307610
Synonyms:2-(6-(4-Cyclopropyl-4H-1,2,4-triazol-3-yl)pyridin-2-yl)-N,N-dimethyl-1-oxoisoindoline-5-carboxamide US10150755, Compound 3
TypeSmall organic molecule
Emp. Form.C20H18N6O2
Mol. Mass.374.3959
SMILESCNC(=O)c1ccc2C(=O)N(Cc2c1)c1cccc(n1)-c1nncn1C1CC1