Reaction Details
TargetMitogen-activated protein kinase kinase kinase 5
LigandBDBM307612
Substrate/Competitorn/a
Meas. Tech.ASK1 Kinase Assay
Ki<200±n/a nM
Citation Brown, SD ASK1 inhibitor compounds and uses thereof US Patent US10150755 Publication Date 12/11/2018
 
Mitogen-activated protein kinase kinase kinase 5
Name:Mitogen-activated protein kinase kinase kinase 5
Type:Protein
Mol. Mass.:154514.93
Organism:Homo sapiens (Human)
Description:Q99683
Residue:1374
BDBM307612
NameBDBM307612
Synonyms:2-(6-(4-cyclopropyl- 4H-1,2,4-triazol-3- yl)pyridin-2-yl)-N- (2-methoxyethyl)-1- oxoisoindoline-5- carboxamide | US10150755, Compound 4
TypeSmall organic molecule
Emp. Form.C22H22N6O3
Mol. Mass.418.4485
SMILESCOCCNC(=O)c1ccc2C(=O)N(Cc2c1)c1cccc(n1)-c1nncn1C1CC1