Reaction Details
TargetMitogen-activated protein kinase kinase kinase 5
LigandBDBM307668
Substrate/Competitorn/a
Meas. Tech.ASK1 Kinase Assay
Ki<200±n/a nM
Citation Brown, SD ASK1 inhibitor compounds and uses thereof US Patent US10150755 Publication Date 12/11/2018
 
Mitogen-activated protein kinase kinase kinase 5
Name:Mitogen-activated protein kinase kinase kinase 5
Type:Protein
Mol. Mass.:154514.93
Organism:Homo sapiens (Human)
Description:Q99683
Residue:1374
BDBM307668
NameBDBM307668
Synonyms:2-(6-(4-cyclopropyl- 4H-1,2,4-triazol-3- yl)pyridin-2-yl)-6- (5- cyclopropylpyrazin- 2-yll)isoindolin-1- one | US10150755, Compound 60
TypeSmall organic molecule
Emp. Form.C25H21N7O
Mol. Mass.435.4805
SMILESO=C1N(Cc2ccc(cc12)-c1cnc(cn1)C1CC1)c1cccc(n1)-c1nncn1C1CC1