Reaction Details
TargetMitogen-activated protein kinase kinase kinase 5
LigandBDBM307673
Substrate/Competitorn/a
Meas. Tech.ASK1 Kinase Assay
Ki<200±n/a nM
Citation Brown, SD ASK1 inhibitor compounds and uses thereof US Patent US10150755 Publication Date 12/11/2018
 
Mitogen-activated protein kinase kinase kinase 5
Name:Mitogen-activated protein kinase kinase kinase 5
Type:Protein
Mol. Mass.:154514.93
Organism:Homo sapiens (Human)
Description:Q99683
Residue:1374
BDBM307673
NameBDBM307673
Synonyms:5-chloro-2-(6-(4-cyclopropyl-4H-1,2,4-triazol-3-yl)pyridin-2-yl)-6-(pyridin-3-yl)isoindolin-1-one | US10150755, Compound 65
TypeSmall organic molecule
Emp. Form.C23H17ClN6O
Mol. Mass.428.874
SMILESClc1cc2CN(C(=O)c2cc1-c1cccnc1)c1cccc(n1)-c1nncn1C1CC1