Reaction Details
TargetMitogen-activated protein kinase kinase kinase 5
LigandBDBM307677
Substrate/Competitorn/a
Meas. Tech.ASK1 Kinase Assay
Ki<200±n/a nM
Citation Brown, SD ASK1 inhibitor compounds and uses thereof US Patent US10150755 Publication Date 12/11/2018
 
Mitogen-activated protein kinase kinase kinase 5
Name:Mitogen-activated protein kinase kinase kinase 5
Type:Protein
Mol. Mass.:154514.93
Organism:Homo sapiens (Human)
Description:Q99683
Residue:1374
BDBM307677
NameBDBM307677
Synonyms:US10150755, Compound 69
TypeSmall organic molecule
Emp. Form.C28H26N6O2
Mol. Mass.478.545
SMILESO=C1N(Cc2cc(OC3CCCC3)c(cc12)-c1cccnc1)c1cccc(n1)-c1nncn1C1CC1