Reaction Details
TargetMitogen-activated protein kinase kinase kinase 5
LigandBDBM307687
Substrate/Competitorn/a
Meas. Tech.ASK1 Kinase Assay
Ki<200±n/a nM
Citation Brown, SD ASK1 inhibitor compounds and uses thereof US Patent US10150755 Publication Date 12/11/2018
 
Mitogen-activated protein kinase kinase kinase 5
Name:Mitogen-activated protein kinase kinase kinase 5
Type:Protein
Mol. Mass.:154514.93
Organism:Homo sapiens (Human)
Description:Q99683
Residue:1374
BDBM307687
NameBDBM307687
Synonyms:(R)-2-(6-(5-(hydroxymethyl)-6,7-dihydro-5H-pyrrolo[2,1-c][1,2,4]triazol-3-yl)pyridin-2-yl)isoindolin-1-one | US10150755, Compound 79
TypeSmall organic molecule
Emp. Form.C19H17N5O2
Mol. Mass.347.3706
SMILESOC[C@H]1CCc2nnc(-c3cccc(n3)N3Cc4ccccc4C3=O)n12