Reaction Details
TargetMitogen-activated protein kinase kinase kinase 5
LigandBDBM307691
Substrate/Competitorn/a
Meas. Tech.ASK1 Kinase Assay
Ki<200±n/a nM
Citation Brown, SD ASK1 inhibitor compounds and uses thereof US Patent US10150755 Publication Date 12/11/2018
 
Mitogen-activated protein kinase kinase kinase 5
Name:Mitogen-activated protein kinase kinase kinase 5
Type:Protein
Mol. Mass.:154514.93
Organism:Homo sapiens (Human)
Description:Q99683
Residue:1374
BDBM307691
NameBDBM307691
Synonyms:2-(6-(5-cyclopropyl-1H-1,2,3-triazol-1-yl)pyridin-2-yl)isoindolin-1-one | US10150755, Compound 83
TypeSmall organic molecule
Emp. Form.C18H15N5O
Mol. Mass.317.3446
SMILESO=C1N(Cc2ccccc12)c1cccc(n1)-n1nncc1C1CC1