Reaction Details
TargetMitogen-activated protein kinase kinase kinase 5
LigandBDBM307693
Substrate/Competitorn/a
Meas. Tech.ASK1 Kinase Assay
Ki<200±n/a nM
Citation Brown, SD ASK1 inhibitor compounds and uses thereof US Patent US10150755 Publication Date 12/11/2018
 
Mitogen-activated protein kinase kinase kinase 5
Name:Mitogen-activated protein kinase kinase kinase 5
Type:Protein
Mol. Mass.:154514.93
Organism:Homo sapiens (Human)
Description:Q99683
Residue:1374
BDBM307693
NameBDBM307693
Synonyms:2-(6-(4-isopropyl-4H-1,2,4-triazol-3-yl)pyridin-2-yl)-6-(pyridin-3-yl)isoindolin-1-one | US10150755, Compound 85
TypeSmall organic molecule
Emp. Form.C23H20N6O
Mol. Mass.396.4445
SMILESCC(C)n1cnnc1-c1cccc(n1)N1Cc2ccc(cc2C1=O)-c1cccnc1