Reaction Details
TargetHistone deacetylase 6
LigandBDBM310717
Substrate/Competitorn/a
Meas. Tech.HDAC inhibitory assay
IC50<500±n/a nM
Citation Shuttleworth, SJTomassi, CDCecil, ARMacCormick, SNodes, WJSilva, FA Histone deacetylase inhibitors and their use in therapy US Patent US10150763 Publication Date 12/11/2018
 
Histone deacetylase 6
Name:Histone deacetylase 6
Type:Chromatin regulator; hydrolase; repressor
Mol. Mass.:131381.51
Organism:Homo sapiens (Human)
Description:Q9UBN7
Residue:1215
BDBM310717
NameBDBM310717
Synonyms:7-((5-Fluoropyridin-2-yl)(3-methyl-1,2,4-oxadiazol-5-yl)amino)-N-hydroxyheptanamide | US10150763, Example Q
TypeSmall organic molecule
Emp. Form.C15H20FN5O3
Mol. Mass.337.3494
SMILESCc1noc(n1)N(CCCCCCC(=O)NO)c1ccc(F)cn1