Reaction Details
TargetHistone deacetylase 6
LigandBDBM310723
Substrate/Competitorn/a
Meas. Tech.HDAC inhibitory assay
IC50<500±n/a nM
Citation Shuttleworth, SJTomassi, CDCecil, ARMacCormick, SNodes, WJSilva, FA Histone deacetylase inhibitors and their use in therapy US Patent US10150763 Publication Date 12/11/2018
 
Histone deacetylase 6
Name:Histone deacetylase 6
Type:Chromatin regulator; hydrolase; repressor
Mol. Mass.:131381.51
Organism:Homo sapiens (Human)
Description:Q9UBN7
Residue:1215
BDBM310723
NameBDBM310723
Synonyms:7-(Benzo[d]oxazol-2-yl(5-fluoropyridin-2-yl)amino)-N-hydroxyheptanamide | US10150763, Example W
TypeSmall organic molecule
Emp. Form.C19H21FN4O3
Mol. Mass.372.3934
SMILESONC(=O)CCCCCCN(c1nc2ccccc2o1)c1ccc(F)cn1