Reaction Details
TargetSerine-protein kinase ATM
LigandBDBM606875
Substrate/Competitorn/a
Meas. Tech.Biological Assay
IC50 2.40±n/a nM
Citation Toledo-Sherman, LMDominguez, CBreccia, PVan De Poël, AJWishart, GVater, HDEsmieu, WRClissold, CBlackaby, WP ATM kinase inhibitors and compositions and methods of use thereof US Patent US11685734 Publication Date 6/27/2023
 
Serine-protein kinase ATM
Name:Serine-protein kinase ATM
Type:Protein
Mol. Mass.:350696.72
Organism:Homo sapiens (Human)
Description:Q13315
Residue:3056
BDBM606875
NameBDBM606875
Synonyms:US11685734, Example 70
TypeSmall organic molecule
Emp. Form.C23H29N3O4
Mol. Mass.411.4941
SMILESO=c1cc(cc([nH]1)N1CCCCC[C@@H]1Cc1cccc2OCOc12)N1CCOCC1